Reaction Details
TargetCarbonic anhydrase 9
LigandBDBM50248708
Substrate/Competitorn/a
Meas. Tech.ChEMBL_1679287 (CHEMBL4029564)
IC50 60±n/a nM
Citation Hou, ZLin, BBao, YYan, HNZhang, MChang, XWZhang, XXWang, ZJWei, GFCheng, MSLiu, YGuo, C Dual-tail approach to discovery of novel carbonic anhydrase IX inhibitors by simultaneously matching the hydrophobic and hydrophilic halves of the active site. Eur J Med Chem132:1-10 (2017) 
 
Carbonic anhydrase 9
Name:Carbonic anhydrase 9
Type:Enzyme
Mol. Mass.:49669.03
Organism:Homo sapiens (Human)
Description:Catalytic domain of human cloned isozyme was used in the assay
Residue:459
BDBM50248708
NameBDBM50248708
Synonyms:CHEMBL4090618
TypeSmall organic molecule
Emp. Form.C23H28N4O8S2
Mol. Mass.552.62
SMILESCOc1ccccc1\C=C\C(=O)N[C@@H]1[C@@H](O)[C@H](O)[C@@H](CO)O[C@H]1NC(=S)Nc1ccc(cc1)S(N)(=O)=O