Reaction Details
TargetProtein-arginine deiminase type-1
LigandBDBM50248814
Substrate/Competitorn/a
Meas. Tech.ChEMBL_1679372 (CHEMBL4029649)
Ki 2417000±n/a nM
Citation Sarswat, AWasilewski, EChakka, SKBello, AMCaprariello, AVMuthuramu, CMStys, PKDunn, SEKotra, LP Inhibitors of protein arginine deiminases and their efficacy in animal models of multiple sclerosis. Bioorg Med Chem25:2643-2656 (2017) 
 
Protein-arginine deiminase type-1
Name:Protein-arginine deiminase type-1
Type:PROTEIN
Mol. Mass.:74664.17
Organism:Homo sapiens (Human)
Description:ChEMBL_1290380
Residue:663
BDBM50248814
NameBDBM50248814
Synonyms:CHEMBL4070114
TypeSmall organic molecule
Emp. Form.C11H16N4O2
Mol. Mass.236.2703
SMILESCc1nccn1CCN1C(=O)NC(C)(C)C1=O