Reaction Details
TargetProtein-arginine deiminase type-1
LigandBDBM50248829
Substrate/Competitorn/a
Meas. Tech.ChEMBL_1679372 (CHEMBL4029649)
Ki 384000±n/a nM
Citation Sarswat, AWasilewski, EChakka, SKBello, AMCaprariello, AVMuthuramu, CMStys, PKDunn, SEKotra, LP Inhibitors of protein arginine deiminases and their efficacy in animal models of multiple sclerosis. Bioorg Med Chem25:2643-2656 (2017) 
 
Protein-arginine deiminase type-1
Name:Protein-arginine deiminase type-1
Type:PROTEIN
Mol. Mass.:74664.17
Organism:Homo sapiens (Human)
Description:ChEMBL_1290380
Residue:663
BDBM50248829
NameBDBM50248829
Synonyms:CHEMBL4084229
TypeSmall organic molecule
Emp. Form.C8H12N6O2
Mol. Mass.224.2199
SMILESCC1(C)NC(=O)N(CCc2nnn[nH]2)C1=O