Reaction Details
TargetSerine/threonine-protein kinase pim-1
LigandBDBM50248841
Substrate/Competitorn/a
Meas. Tech.ChEMBL_1679402 (CHEMBL4029679)
IC50 273±n/a nM
Citation Bataille, CJBrennan, MBByrne, SDavies, SGDurbin, MFedorov, OHuber, KVJones, AMKnapp, SLiu, GNadali, AQuevedo, CERussell, AJWalker, RGWestwood, RWynne, GM Thiazolidine derivatives as potent and selective inhibitors of the PIM kinase family. Bioorg Med Chem25:2657-2665 (2017) 
 
Serine/threonine-protein kinase pim-1
Name:Serine/threonine-protein kinase pim-1
Type:Protein
Mol. Mass.:35681.82
Organism:Homo sapiens (Human)
Description:P11309
Residue:313
BDBM50248841
NameBDBM50248841
Synonyms:CHEMBL4069868
TypeSmall organic molecule
Emp. Form.C13H9N3O2S
Mol. Mass.271.294
SMILESO=C1NC(=S)N2C1=CC1C(Nc3ccccc13)C2=O