Reaction Details
TargetSerine/threonine-protein kinase pim-1
LigandBDBM50248868
Substrate/Competitorn/a
Meas. Tech.ChEMBL_1679402 (CHEMBL4029679)
IC50 55±n/a nM
Citation Bataille, CJBrennan, MBByrne, SDavies, SGDurbin, MFedorov, OHuber, KVJones, AMKnapp, SLiu, GNadali, AQuevedo, CERussell, AJWalker, RGWestwood, RWynne, GM Thiazolidine derivatives as potent and selective inhibitors of the PIM kinase family. Bioorg Med Chem25:2657-2665 (2017) 
 
Serine/threonine-protein kinase pim-1
Name:Serine/threonine-protein kinase pim-1
Type:Protein
Mol. Mass.:35681.82
Organism:Homo sapiens (Human)
Description:P11309
Residue:313
BDBM50248868
NameBDBM50248868
Synonyms:CHEMBL4091496
TypeSmall organic molecule
Emp. Form.C13H8N2OS2
Mol. Mass.272.345
SMILESO=C1NC(=S)S\C1=C/c1ccc2ccccc2n1