Reaction Details
TargetSerine/threonine-protein kinase pim-1
LigandBDBM50248896
Substrate/Competitorn/a
Meas. Tech.ChEMBL_1679402 (CHEMBL4029679)
IC50 36±n/a nM
Citation Bataille, CJBrennan, MBByrne, SDavies, SGDurbin, MFedorov, OHuber, KVJones, AMKnapp, SLiu, GNadali, AQuevedo, CERussell, AJWalker, RGWestwood, RWynne, GM Thiazolidine derivatives as potent and selective inhibitors of the PIM kinase family. Bioorg Med Chem25:2657-2665 (2017) 
 
Serine/threonine-protein kinase pim-1
Name:Serine/threonine-protein kinase pim-1
Type:Protein
Mol. Mass.:35681.82
Organism:Homo sapiens (Human)
Description:P11309
Residue:313
BDBM50248896
NameBDBM50248896
Synonyms:CHEMBL4068718
TypeSmall organic molecule
Emp. Form.C13H7ClN2OS3
Mol. Mass.338.855
SMILESClc1cccc(c1)-c1nc(\C=C2/SC(=S)NC2=O)cs1