Reaction Details
TargetSerine/threonine-protein kinase pim-1
LigandBDBM50248920
Substrate/Competitorn/a
Meas. Tech.ChEMBL_1679402 (CHEMBL4029679)
IC50 2.2±n/a nM
Citation Bataille, CJBrennan, MBByrne, SDavies, SGDurbin, MFedorov, OHuber, KVJones, AMKnapp, SLiu, GNadali, AQuevedo, CERussell, AJWalker, RGWestwood, RWynne, GM Thiazolidine derivatives as potent and selective inhibitors of the PIM kinase family. Bioorg Med Chem25:2657-2665 (2017) 
 
Serine/threonine-protein kinase pim-1
Name:Serine/threonine-protein kinase pim-1
Type:Protein
Mol. Mass.:35681.82
Organism:Homo sapiens (Human)
Description:P11309
Residue:313
BDBM50248920
NameBDBM50248920
Synonyms:CHEMBL4079975
TypeSmall organic molecule
Emp. Form.C15H14N4O3S4
Mol. Mass.426.557
SMILESCN(C)S(=O)(=O)Nc1cccc(c1)-c1nc(\C=C2/SC(=S)NC2=O)cs1