Reaction Details
TargetSerine/threonine-protein kinase pim-1
LigandBDBM50248921
Substrate/Competitorn/a
Meas. Tech.ChEMBL_1679402 (CHEMBL4029679)
IC50 3.6±n/a nM
Citation Bataille, CJBrennan, MBByrne, SDavies, SGDurbin, MFedorov, OHuber, KVJones, AMKnapp, SLiu, GNadali, AQuevedo, CERussell, AJWalker, RGWestwood, RWynne, GM Thiazolidine derivatives as potent and selective inhibitors of the PIM kinase family. Bioorg Med Chem25:2657-2665 (2017) 
 
Serine/threonine-protein kinase pim-1
Name:Serine/threonine-protein kinase pim-1
Type:Protein
Mol. Mass.:35681.82
Organism:Homo sapiens (Human)
Description:P11309
Residue:313
BDBM50248921
NameBDBM50248921
Synonyms:CHEMBL4096030
TypeSmall organic molecule
Emp. Form.C14H10N2O3S4
Mol. Mass.382.501
SMILESCS(=O)(=O)c1ccc(cc1)-c1nc(\C=C2/SC(=S)NC2=O)cs1