Reaction Details
TargetSerine/threonine-protein kinase Chk1
LigandBDBM50248937
Substrate/Competitorn/a
Meas. Tech.ChEMBL_1679546 (CHEMBL4029823)
Ki 7.0±n/a nM
Citation Edupuganti, RTaliaferro, JMWang, QXie, XCho, EJVidhu, FRen, PAnslyn, EVBartholomeusz, CDalby, KN Discovery of a potent inhibitor of MELK that inhibits expression of the anti-apoptotic protein Mcl-1 and TNBC cell growth. Bioorg Med Chem25:2609-2616 (2017) 
 
Serine/threonine-protein kinase Chk1
Name:Serine/threonine-protein kinase Chk1
Type:Enzyme Catalytic Domain
Mol. Mass.:54443.02
Organism:Homo sapiens (Human)
Description:gi_166295192
Residue:476
BDBM50248937
NameBDBM50248937
Synonyms:CHEMBL4062168 | US10981896, Compound 15
TypeSmall organic molecule
Emp. Form.C31H33N5O4
Mol. Mass.539.6248
SMILESCOC(=O)c1ccc2NC(=O)\C(=C(/Nc3ccc(cc3)N(C)C(=O)CN3CCN(C)CC3)c3ccccc3)c2c1