Reaction Details
TargetMuscarinic acetylcholine receptor M2
LigandBDBM50249030
Substrate/Competitorn/a
Meas. Tech.ChEMBL_1679672 (CHEMBL4029949)
Ki 158±n/a nM
Citation Johnstone, SAlbert, JS Pharmacological property optimization for allosteric ligands: A medicinal chemistry perspective. Bioorg Med Chem Lett27:2239-2258 (2017) 
 
Muscarinic acetylcholine receptor M2
Name:Muscarinic acetylcholine receptor M2
Type:GPCR
Mol. Mass.:51730.61
Organism:Homo sapiens (Human)
Description:P08172
Residue:466
BDBM50249030
NameBDBM50249030
Synonyms:CHEMBL3770346
TypeSmall organic molecule
Emp. Form.C13H14ClN3O2S
Mol. Mass.311.787
SMILESCOc1nc2sc(C(=O)NC3CC3)c(N)c2c(C)c1Cl