Reaction Details
TargetP2X purinoceptor 7
LigandBDBM50237727
Substrate/Competitorn/a
Meas. Tech.ChEMBL_1679689 (CHEMBL4029966)
IC50 100±n/a nM
Citation Wong, ECNReekie, TAWerry, ELO'Brien-Brown, JBowyer, SLKassiou, M Pharmacological evaluation of a novel series of urea, thiourea and guanidine derivatives as P2X Bioorg Med Chem Lett27:2439-2442 (2017) 
 
P2X purinoceptor 7
Name:P2X purinoceptor 7
Type:Protein
Mol. Mass.:68602.85
Organism:Homo sapiens (Human)
Description:Q99572
Residue:595
BDBM50237727
NameBDBM50237727
Synonyms:CHEMBL4060938
TypeSmall organic molecule
Emp. Form.C19H24N4
Mol. Mass.308.4207
SMILESN#C\N=C(/NCC12CC3CC(CC(C3)C1)C2)Nc1ccccc1