Reaction Details
TargetCytochrome P450 11B1, mitochondrial
LigandBDBM50249076
Substrate/Competitorn/a
Meas. Tech.ChEMBL_1679696 (CHEMBL4029973)
IC50 1.1±n/a nM
Citation Hoyt, SBTaylor, JLondon, CAli, AUjjainwalla, FTata, JStruthers, MCully, DWisniewski, TRen, NBopp, CSok, AVerras, AMcMasters, DChen, QTung, ETang, WSalituro, GClemas, JZhou, GMacNeil, DDuffy, RXiong, Y Discovery of indazole aldosterone synthase (CYP11B2) inhibitors as potential treatments for hypertension. Bioorg Med Chem Lett27:2384-2388 (2017) 
 
Cytochrome P450 11B1, mitochondrial
Name:Cytochrome P450 11B1, mitochondrial
Type:Enzyme
Mol. Mass.:57591.44
Organism:Homo sapiens (Human)
Description:P15538
Residue:503
BDBM50249076
NameBDBM50249076
Synonyms:CHEMBL4096914
TypeSmall organic molecule
Emp. Form.C15H13ClFN3O
Mol. Mass.305.735
SMILESCC(C)(O)c1cncc(c1)-n1ncc2c(Cl)ccc(F)c12