Reaction Details
TargetCytochrome P450 11B2, mitochondrial
LigandBDBM50249075
Substrate/Competitorn/a
Meas. Tech.ChEMBL_1679695 (CHEMBL4029972)
IC50 0.300000±n/a nM
Citation Hoyt, SBTaylor, JLondon, CAli, AUjjainwalla, FTata, JStruthers, MCully, DWisniewski, TRen, NBopp, CSok, AVerras, AMcMasters, DChen, QTung, ETang, WSalituro, GClemas, JZhou, GMacNeil, DDuffy, RXiong, Y Discovery of indazole aldosterone synthase (CYP11B2) inhibitors as potential treatments for hypertension. Bioorg Med Chem Lett27:2384-2388 (2017) 
 
Cytochrome P450 11B2, mitochondrial
Name:Cytochrome P450 11B2, mitochondrial
Type:Protein
Mol. Mass.:57582.15
Organism:Homo sapiens (Human)
Description:P19099
Residue:503
BDBM50249075
NameBDBM50249075
Synonyms:CHEMBL4069720
TypeSmall organic molecule
Emp. Form.C15H13F2N3O
Mol. Mass.289.28
SMILESCC(C)(O)c1cncc(c1)-n1ncc2c(F)ccc(F)c12