Reaction Details
TargetThymidylate synthase
LigandBDBM50005329
Substrate/Competitorn/a
Meas. Tech.ChEBML_208947
Ki 11±n/a nM
Citation Reich, SHFuhry, MANguyen, DPino, MJWelsh, KMWebber, SJanson, CAJordan, SRMatthews, DASmith, WW Design and synthesis of novel 6,7-imidazotetrahydroquinoline inhibitors of thymidylate synthase using iterative protein crystal structure analysis. J Med Chem35:847-58 (1992) Thymidylate synthase
Name:Thymidylate synthase
Type:n/a
Mol. Mass.:30487.86
Organism:Escherichia coli
Description:n/a
Residue:264
BDBM50005329
NameBDBM50005329
Synonyms:5-[4-(Morpholine-4-sulfonyl)-benzyl]-5,6,7,8-tetrahydro-1H-imidazo[4,5-g]quinolin-2-ylamine | CHEMBL168524
TypeSmall organic molecule
Emp. Form.C21H25N5O3S
Mol. Mass.427.52
SMILESNc1nc2cc3CCCN(Cc4ccc(cc4)S(=O)(=O)N4CCOCC4)c3cc2[nH]1