Reaction Details
TargetThymidylate synthase
LigandBDBM50005330
Substrate/Competitorn/a
Meas. Tech.ChEBML_208947
Ki 43±n/a nM
Citation Reich, SHFuhry, MANguyen, DPino, MJWelsh, KMWebber, SJanson, CAJordan, SRMatthews, DASmith, WW Design and synthesis of novel 6,7-imidazotetrahydroquinoline inhibitors of thymidylate synthase using iterative protein crystal structure analysis. J Med Chem35:847-58 (1992) Thymidylate synthase
Name:Thymidylate synthase
Type:n/a
Mol. Mass.:30487.86
Organism:Escherichia coli
Description:n/a
Residue:264
BDBM50005330
NameBDBM50005330
Synonyms:5-(4-Benzenesulfonyl-benzyl)-5,6,7,8-tetrahydro-1H-imidazo[4,5-g]quinolin-2-ylamine CHEMBL301256
TypeSmall organic molecule
Emp. Form.C23H22N4O2S
Mol. Mass.418.511
SMILESNc1nc2cc3CCCN(Cc4ccc(cc4)S(=O)(=O)c4ccccc4)c3cc2[nH]1