Reaction Details
TargetThymidylate synthase
LigandBDBM50005332
Substrate/Competitorn/a
Meas. Tech.ChEBML_209652
Ki 24±n/a nM
Citation Reich, SHFuhry, MANguyen, DPino, MJWelsh, KMWebber, SJanson, CAJordan, SRMatthews, DASmith, WW Design and synthesis of novel 6,7-imidazotetrahydroquinoline inhibitors of thymidylate synthase using iterative protein crystal structure analysis. J Med Chem35:847-58 (1992) Thymidylate synthase
Name:Thymidylate synthase
Type:Enzyme
Mol. Mass.:35718.07
Organism:Homo sapiens (Human)
Description:n/a
Residue:313
BDBM50005332
NameBDBM50005332
Synonyms:5-[4-(4-Methoxy-benzenesulfonyl)-benzyl]-5,6,7,8-tetrahydro-1H-imidazo[4,5-g]quinolin-2-ylamine | CHEMBL171314
TypeSmall organic molecule
Emp. Form.C24H24N4O3S
Mol. Mass.448.537
SMILESCOc1ccc(cc1)S(=O)(=O)c1ccc(CN2CCCc3cc4nc(N)[nH]c4cc23)cc1