Reaction Details
TargetATP-sensitive inward rectifier potassium channel 1
LigandBDBM50249187
Substrate/Competitorn/a
Meas. Tech.ChEMBL_1679734 (CHEMBL4030011)
IC50 42±n/a nM
Citation Dong, SVanGelder, KShi, ZCYu, YWu, ZFerguson, RGuo, ZZTang, HFrie, JFu, QGu, XPriest, BTThomas-Fowlkes, BWeinglass, AMargulis, MLiu, JPai, LYHampton, CHaimbach, REOwens, KTong, VXu, SHu, MZingaro, GJMorissette, PEhrhart, JRoy, SSullivan, KPasternak, A Improvement of hERG-ROMK index of spirocyclic ROMK inhibitors through scaffold optimization and incorporation of novel pharmacophores. Bioorg Med Chem Lett27:2559-2566 (2017) 
 
ATP-sensitive inward rectifier potassium channel 1
Name:ATP-sensitive inward rectifier potassium channel 1
Type:Enzyme Catalytic Domain
Mol. Mass.:44809.08
Organism:Homo sapiens (Human)
Description:gi_223460826
Residue:391
BDBM50249187
NameBDBM50249187
Synonyms:CHEMBL4075415
TypeSmall organic molecule
Emp. Form.C25H30N4O5
Mol. Mass.466.5295
SMILESC[C@@H]([C@H](O)c1ccc2C(=O)OCc2c1C)N1CCC2(CCN(C2=O)c2ccc(=O)n(C)n2)CC1