Reaction Details
TargetCytochrome P450 1A2
LigandBDBM50249434
Substrate/Competitorn/a
Meas. Tech.ChEMBL_1679901 (CHEMBL4030178)
IC50 2500±n/a nM
Citation Melancon, BJWood, MRNoetzel, MJNance, KDEngelberg, EMHan, CLamsal, AChang, SCho, HPByers, FWBubser, MJones, CKNiswender, CMWood, MWEngers, DWWu, DBrandon, NJDuggan, MEConn, PJBridges, TMLindsley, CW Optimization of M Bioorg Med Chem Lett27:2296-2301 (2017) 
 
Cytochrome P450 1A2
Name:Cytochrome P450 1A2
Type:Enzyme
Mol. Mass.:58423.38
Organism:Homo sapiens (Human)
Description:P05177
Residue:516
BDBM50249434
NameBDBM50249434
Synonyms:CHEMBL4094439
TypeSmall organic molecule
Emp. Form.C21H18FN5OS
Mol. Mass.407.464
SMILESCc1nnc2sc(C(=O)NCc3ccc(cc3)-c3ccnc(F)c3)c(N)c2c1C