Reaction Details
TargetCytochrome P450 3A4
LigandBDBM50249405
Substrate/Competitorn/a
Meas. Tech.ChEMBL_1679904 (CHEMBL4030181)
IC50 25000±n/a nM
Citation Melancon, BJWood, MRNoetzel, MJNance, KDEngelberg, EMHan, CLamsal, AChang, SCho, HPByers, FWBubser, MJones, CKNiswender, CMWood, MWEngers, DWWu, DBrandon, NJDuggan, MEConn, PJBridges, TMLindsley, CW Optimization of M Bioorg Med Chem Lett27:2296-2301 (2017) 
 
Cytochrome P450 3A4
Name:Cytochrome P450 3A4
Type:Enzyme
Mol. Mass.:57349.57
Organism:Homo sapiens (Human)
Description:n/a
Residue:503
BDBM50249405
NameBDBM50249405
Synonyms:CHEMBL4102040
TypeSmall organic molecule
Emp. Form.C21H18FN5OS
Mol. Mass.407.464
SMILESCc1nnc2sc(C(=O)NCc3ccc(cc3)-c3ccc(F)nc3)c(N)c2c1C