Reaction Details
TargetProto-oncogene tyrosine-protein kinase Src
LigandBDBM50250009
Substrate/Competitorn/a
Meas. Tech.ChEBML_1680860
IC50>10000±n/a nM
Citation Rutaganira, FUBarks, JDhason, MSWang, QLopez, MSLong, SRadke, JBJones, NGMaddirala, ARJanetka, JWEl Bakkouri, MHui, RShokat, KMSibley, LD Inhibition of Calcium Dependent Protein Kinase 1 (CDPK1) by Pyrazolopyrimidine Analogs Decreases Establishment and Reoccurrence of Central Nervous System Disease by Toxoplasma gondii. J Med Chem60:9976-9989 (2017) 
 
Proto-oncogene tyrosine-protein kinase Src
Name:Proto-oncogene tyrosine-protein kinase Src
Type:Protein
Mol. Mass.:59838.60
Organism:Homo sapiens (Human)
Description:P12931
Residue:536
BDBM50250009
NameBDBM50250009
Synonyms:CHEMBL4096137 | US11208411, Compound FUR
TypeSmall organic molecule
Emp. Form.C18H21ClN6
Mol. Mass.356.853
SMILESNc1ncnc2n(CC3CCNCC3)nc(Cc3cccc(Cl)c3)c12