Reaction Details
TargetCalmodulin-domain protein kinase 1
LigandBDBM50250001
Substrate/Competitorn/a
Meas. Tech.ChEBML_1680859
IC50 78±n/a nM
Citation Rutaganira, FUBarks, JDhason, MSWang, QLopez, MSLong, SRadke, JBJones, NGMaddirala, ARJanetka, JWEl Bakkouri, MHui, RShokat, KMSibley, LD Inhibition of Calcium Dependent Protein Kinase 1 (CDPK1) by Pyrazolopyrimidine Analogs Decreases Establishment and Reoccurrence of Central Nervous System Disease by Toxoplasma gondii. J Med Chem60:9976-9989 (2017) 
 
Calmodulin-domain protein kinase 1
Name:Calmodulin-domain protein kinase 1
Type:Enzyme Catalytic Domain
Mol. Mass.:57248.42
Organism:Toxoplasma gondii
Description:n/a
Residue:507
BDBM50250001
NameBDBM50250001
Synonyms:CHEMBL4090973 | US11208411, Compound FUR7-30
TypeSmall organic molecule
Emp. Form.C18H21ClN6O
Mol. Mass.372.852
SMILESCN1CCC(Cn2nc(Oc3cccc(Cl)c3)c3c(N)ncnc23)CC1