Reaction Details
TargetProto-oncogene tyrosine-protein kinase Src
LigandBDBM50250014
Substrate/Competitorn/a
Meas. Tech.ChEBML_1680860
IC50 607±n/a nM
Citation Rutaganira, FUBarks, JDhason, MSWang, QLopez, MSLong, SRadke, JBJones, NGMaddirala, ARJanetka, JWEl Bakkouri, MHui, RShokat, KMSibley, LD Inhibition of Calcium Dependent Protein Kinase 1 (CDPK1) by Pyrazolopyrimidine Analogs Decreases Establishment and Reoccurrence of Central Nervous System Disease by Toxoplasma gondii. J Med Chem60:9976-9989 (2017) 
 
Proto-oncogene tyrosine-protein kinase Src
Name:Proto-oncogene tyrosine-protein kinase Src
Type:Protein
Mol. Mass.:59838.60
Organism:Homo sapiens (Human)
Description:P12931
Residue:536
BDBM50250014
NameBDBM50250014
Synonyms:CHEMBL2324597 | US11208411, Compound 3CIB-PP1
TypeSmall organic molecule
Emp. Form.C16H18ClN5
Mol. Mass.315.801
SMILESCC(C)(C)n1nc(Cc2cccc(Cl)c2)c2c(N)ncnc12