Reaction Details
TargetProto-oncogene tyrosine-protein kinase Src
LigandBDBM50250007
Substrate/Competitorn/a
Meas. Tech.ChEBML_1680860
IC50>10000±n/a nM
Citation Rutaganira, FUBarks, JDhason, MSWang, QLopez, MSLong, SRadke, JBJones, NGMaddirala, ARJanetka, JWEl Bakkouri, MHui, RShokat, KMSibley, LD Inhibition of Calcium Dependent Protein Kinase 1 (CDPK1) by Pyrazolopyrimidine Analogs Decreases Establishment and Reoccurrence of Central Nervous System Disease by Toxoplasma gondii. J Med Chem60:9976-9989 (2017) 
 
Proto-oncogene tyrosine-protein kinase Src
Name:Proto-oncogene tyrosine-protein kinase Src
Type:Protein
Mol. Mass.:59838.60
Organism:Homo sapiens (Human)
Description:P12931
Residue:536
BDBM50250007
NameBDBM50250007
Synonyms:CHEMBL4073069 | US11208411, Compound FUR6-13
TypeSmall organic molecule
Emp. Form.C16H17ClN6O
Mol. Mass.344.799
SMILESNc1ncnc2n(CC3CCNC3)nc(Oc3cccc(Cl)c3)c12