Reaction Details
TargetGlucocorticoid receptor
LigandBDBM141372
Substrate/Competitorn/a
Meas. Tech.ChEMBL_1680919 (CHEMBL4031196)
IC50 0.900000±n/a nM
Citation Hemmerling, MNilsson, SEdman, KEirefelt, SRussell, WHendrickx, RJohnsson, EKärrman Mårdh, CBerger, MRehwinkel, HAbrahamsson, ADahmén, JEriksson, ARGabos, BHenriksson, KHossain, NIvanova, SJansson, AHJensen, TJJerre, AJohansson, HKlingstedt, TLepistö, MLindsjö, MMile, INikitidis, GSteele, JTehler, UWissler, LHansson, T Selective Nonsteroidal Glucocorticoid Receptor Modulators for the Inhaled Treatment of Pulmonary Diseases. J Med Chem60:8591-8605 (2017) 
 
Glucocorticoid receptor
Name:Glucocorticoid receptor
Type:Enzyme
Mol. Mass.:85656.87
Organism:Homo sapiens (Human)
Description:P04150
Residue:777
BDBM141372
NameBDBM141372
Synonyms:US8916600, 6 | US9738632, Example 6
TypeSmall organic molecule
Emp. Form.C32H32F2N4O6
Mol. Mass.606.6165
SMILESC[C@H](NC(=O)C(C)(F)F)[C@H](Oc1ccc2n(ncc2c1)-c1cccc(c1)C(=O)N[C@@H]1CCOC1)c1ccc2OCCOc2c1