Reaction Details
TargetMelanocortin receptor 4
LigandBDBM50027084
Substrate/Competitorn/a
Meas. Tech.ChEBML_1681326
EC50 8.6±n/a nM
Citation Palmer, DGonçalves, JPLV Hansen, LWu, BHald, HSchoffelen, SDiness, FLe Quement, STNielsen, TEMeldal, M Click-Chemistry-Mediated Synthesis of Selective Melanocortin Receptor 4 Agonists. J Med Chem60:8716-8730 (2017) 
 
Melanocortin receptor 4
Name:Melanocortin receptor 4
Type:Enzyme
Mol. Mass.:36949.50
Organism:Homo sapiens (Human)
Description:P32245
Residue:332
BDBM50027084
NameBDBM50027084
Synonyms:Melatonan
TypeSmall organic molecule
Emp. Form.C50H69N15O9
Mol. Mass.1024.178
SMILESCCCC[C@H](NC(C)=O)C(=O)N[C@H]1CC(=O)NCCCC[C@H](NC(=O)[C@H](Cc2c[nH]c3ccccc23)NC(=O)[C@H](CCCNC(N)=N)NC(=O)[C@@H](Cc2ccccc2)NC(=O)[C@H](Cc2cnc[nH]2)NC1=O)C(N)=O