Reaction Details
TargetMelanocortin receptor 3
LigandBDBM50017181
Substrate/Competitorn/a
Meas. Tech.ChEBML_1681317
EC50 6.8±n/a nM
Citation Palmer, DGonçalves, JPLV Hansen, LWu, BHald, HSchoffelen, SDiness, FLe Quement, STNielsen, TEMeldal, M Click-Chemistry-Mediated Synthesis of Selective Melanocortin Receptor 4 Agonists. J Med Chem60:8716-8730 (2017) 
 
Melanocortin receptor 3
Name:Melanocortin receptor 3
Type:Enzyme
Mol. Mass.:36044.86
Organism:Homo sapiens (Human)
Description:P41968
Residue:323
BDBM50017181
NameBDBM50017181
Synonyms:CHEMBL441738
TypeSmall organic molecule
Emp. Form.C78H111N21O19
Mol. Mass.1646.8452
SMILESCCCC[C@H](NC(=O)[C@H](CO)NC(=O)[C@H](Cc1ccc(O)cc1)NC(=O)[C@H](CO)NC(C)=O)C(=O)N[C@@H](CCC(O)=O)C(=O)N[C@@H](Cc1cnc[nH]1)C(=O)N[C@H](Cc1ccccc1)C(=O)N[C@@H](CCCNC(N)=N)C(=O)N[C@@H](Cc1c[nH]c2ccccc12)C(=O)NCC(=O)N[C@@H](CCCCN)C(=O)N1CCC[C@H]1C(=O)N[C@@H](C(C)C)C(N)=O