Reaction Details
TargetPancreatic alpha-amylase
LigandBDBM50005684
Substrate/Competitorn/a
Meas. Tech.ChEBML_34104
IC50 21±n/a nM
Citation Leader, HGordon, RKBaumgold, JBoyd, VLNewman, AHSmejkal, RMChiang, PK Muscarinic receptor subtype specificity of (N,N-dialkylamino)alkyl 2-cyclohexyl-2-phenylpropionates: cylexphenes (cyclohexyl-substituted aprophen analogues). J Med Chem35:1290-5 (1992) Pancreatic alpha-amylase
Name:Pancreatic alpha-amylase
Type:PROTEIN
Mol. Mass.:57186.64
Organism:Rattus norvegicus
Description:ChEMBL_34101
Residue:508
BDBM50005684
NameBDBM50005684
Synonyms:2-Cyclohexyl-2-phenyl-propionic acid 3-diethylamino-propyl ester | CHEMBL284137
TypeSmall organic molecule
Emp. Form.C22H35NO2
Mol. Mass.345.5188
SMILESCCN(CC)CCCOC(=O)C(C)(C1CCCCC1)c1ccccc1