Reaction Details
TargetLeucine-rich repeat serine/threonine-protein kinase 2
LigandBDBM50250337
Substrate/Competitorn/a
Meas. Tech.ChEBML_1681545
Ki 3026±n/a nM
Citation Williamson, DSSmith, GPAcheson-Dossang, PBedford, STChell, VChen, IJDaechsel, JCADaniels, ZDavid, LDokurno, PHentzer, MHerzig, MCHubbard, REMoore, JDMurray, JBNewland, SRay, SCShaw, TSurgenor, AETerry, LThirstrup, KWang, YChristensen, KV Design of Leucine-Rich Repeat Kinase 2 (LRRK2) Inhibitors Using a Crystallographic Surrogate Derived from Checkpoint Kinase 1 (CHK1). J Med Chem60:8945-8962 (2017) 
 
Leucine-rich repeat serine/threonine-protein kinase 2
Name:Leucine-rich repeat serine/threonine-protein kinase 2
Type:Protein
Mol. Mass.:286113.20
Organism:Homo sapiens (Human)
Description:Q5S007
Residue:2527
BDBM50250337
NameBDBM50250337
Synonyms:CHEMBL4075970
TypeSmall organic molecule
Emp. Form.C8H5N3
Mol. Mass.143.1454
SMILESN#Cc1c[nH]c2ncccc12