Reaction Details
TargetLeucine-rich repeat serine/threonine-protein kinase 2
LigandBDBM254921
Substrate/Competitorn/a
Meas. Tech.ChEMBL_1681544 (CHEMBL4031821)
Ki 60±n/a nM
Citation Williamson, DSSmith, GPAcheson-Dossang, PBedford, STChell, VChen, IJDaechsel, JCADaniels, ZDavid, LDokurno, PHentzer, MHerzig, MCHubbard, REMoore, JDMurray, JBNewland, SRay, SCShaw, TSurgenor, AETerry, LThirstrup, KWang, YChristensen, KV Design of Leucine-Rich Repeat Kinase 2 (LRRK2) Inhibitors Using a Crystallographic Surrogate Derived from Checkpoint Kinase 1 (CHK1). J Med Chem60:8945-8962 (2017) 
 
Leucine-rich repeat serine/threonine-protein kinase 2
Name:Leucine-rich repeat serine/threonine-protein kinase 2
Type:Protein
Mol. Mass.:286113.20
Organism:Homo sapiens (Human)
Description:Q5S007
Residue:2527
BDBM254921
NameBDBM254921
Synonyms:US9499542, 4 | US9675594, 4
TypeSmall organic molecule
Emp. Form.C12H7N3S
Mol. Mass.225.269
SMILESN#Cc1c[nH]c2nccc(-c3ccsc3)c12