Reaction Details
TargetCholesteryl ester transfer protein
LigandBDBM50250370
Substrate/Competitorn/a
Meas. Tech.ChEBML_1681594
IC50 200±n/a nM
Citation Yamada, KBrousseau, MHonma, WIimura, AImase, HIwaki, YKawanami, TLaSala, DLiang, GMitani, HNonomura, KOhmori, OPan, MRigel, DFUmemura, IYasoshima, KZhu, GMogi, M Discovery of a Novel Piperidine-Based Inhibitor of Cholesteryl Ester Transfer Protein (CETP) That Retains Activity in Hypertriglyceridemic Plasma. J Med Chem60:8466-8481 (2017) 
 
Cholesteryl ester transfer protein
Name:Cholesteryl ester transfer protein
Type:Enzyme
Mol. Mass.:54751.53
Organism:Homo sapiens (Human)
Description:P11597
Residue:493
BDBM50250370
NameBDBM50250370
Synonyms:CHEMBL4083767
TypeSmall organic molecule
Emp. Form.C31H33BrF6N4O2
Mol. Mass.687.514
SMILESCC[C@@H]1C[C@@H](C[C@H](Cc2ccccc2)N1C(=O)OC(C)C)N(Cc1cc(cc(c1)C(F)(F)F)C(F)(F)F)c1ncc(Br)cn1