Reaction Details
TargetAtypical chemokine receptor 3
LigandBDBM50250385
Substrate/Competitorn/a
Meas. Tech.ChEMBL_1681650 (CHEMBL4031927)
Ki 398±n/a nM
Citation Boehm, MBeaumont, KJones, RKalgutkar, ASZhang, LAtkinson, KBai, GBrown, JAEng, HGoetz, GHHolder, BRKhunte, BLazzaro, SLimberakis, CRyu, SShapiro, MJTylaska, LYan, JTurner, RLeung, SSFRamaseshan, MPrice, DALiras, SJacobson, MPEarp, DJLokey, RSMathiowetz, AMMenhaji-Klotz, E Discovery of Potent and Orally Bioavailable Macrocyclic Peptide-Peptoid Hybrid CXCR7 Modulators. J Med Chem60:9653-9663 (2017) 
 
Atypical chemokine receptor 3
Name:Atypical chemokine receptor 3
Type:Enzyme
Mol. Mass.:41498.84
Organism:Homo sapiens (Human)
Description:P25106
Residue:362
BDBM50250385
NameBDBM50250385
Synonyms:CHEMBL4074560
TypeSmall organic molecule
Emp. Form.C54H58N10O6
Mol. Mass.943.1017
SMILESCn1cnc(C[C@@H]2NC(=O)[C@H](Cc3c[nH]c4ccccc34)NC(=O)[C@@H](Cc3ccccc3)NC(=O)[C@H](Cc3c[nH]c4ccccc34)NC(=O)CN(CCCc3ccccc3)C(=O)[C@H]3CCCN3C2=O)c1