Reaction Details
TargetMu-type opioid receptor
LigandBDBM50250452
Substrate/Competitorn/a
Meas. Tech.ChEMBL_1681727 (CHEMBL4032004)
EC50 9±n/a nM
Citation Dumitrascuta, MBen Haddou, TGuerrieri, ENoha, SMSchläfer, LSchmidhammer, HSpetea, M Synthesis, Pharmacology, and Molecular Docking Studies on 6-Desoxo-N-methylmorphinans as Potent?-Opioid Receptor Agonists. J Med Chem60:9407-9412 (2017) 
 
Mu-type opioid receptor
Name:Mu-type opioid receptor
Type:G Protein-Coupled Receptor (GPCR)
Mol. Mass.:44789.51
Organism:Homo sapiens (Human)
Description:P35372
Residue:400
BDBM50250452
NameBDBM50250452
Synonyms:CHEMBL4074110
TypeSmall organic molecule
Emp. Form.C17H21NO3
Mol. Mass.287.3535
SMILES[H][C@@]12CCC[C@@]3(O)[C@@]4([H])Cc5ccc(O)c(O1)c5[C@@]23CCN4C