Reaction Details
TargetMu-type opioid receptor
LigandBDBM50142700
Substrate/Competitorn/a
Meas. Tech.ChEMBL_1681722 (CHEMBL4031999)
Ki 0.250000±n/a nM
Citation Dumitrascuta, MBen Haddou, TGuerrieri, ENoha, SMSchläfer, LSchmidhammer, HSpetea, M Synthesis, Pharmacology, and Molecular Docking Studies on 6-Desoxo-N-methylmorphinans as Potent?-Opioid Receptor Agonists. J Med Chem60:9407-9412 (2017) 
 
Mu-type opioid receptor
Name:Mu-type opioid receptor
Type:G Protein-Coupled Receptor (GPCR)
Mol. Mass.:44789.51
Organism:Homo sapiens (Human)
Description:P35372
Residue:400
BDBM50142700
NameBDBM50142700
Synonyms:CHEMBL326684
TypeSmall organic molecule
Emp. Form.C19H23NO4
Mol. Mass.329.3902
SMILES[H][C@@]12Cc3ccc(O)c4O[C@@]5(C)C(=O)CC[C@]1(OC)[C@@]5(CCN2C)c34