Reaction Details
TargetDelta-type opioid receptor
LigandBDBM50142700
Substrate/Competitorn/a
Meas. Tech.ChEBML_1681723
Ki 20±n/a nM
Citation Dumitrascuta, MBen Haddou, TGuerrieri, ENoha, SMSchläfer, LSchmidhammer, HSpetea, M Synthesis, Pharmacology, and Molecular Docking Studies on 6-Desoxo-N-methylmorphinans as Potent?-Opioid Receptor Agonists. J Med Chem60:9407-9412 (2017) 
 
Delta-type opioid receptor
Name:Delta-type opioid receptor
Type:G Protein-Coupled Receptor (GPCR)
Mol. Mass.:40382.98
Organism:Homo sapiens (Human)
Description:Competition binding assays were carried out using membrane preparations from transfected HN9.10 cells that constitutively expressed the delta opioid receptor.
Residue:372
BDBM50142700
NameBDBM50142700
Synonyms:CHEMBL326684
TypeSmall organic molecule
Emp. Form.C19H23NO4
Mol. Mass.329.3902
SMILES[H][C@@]12Cc3ccc(O)c4O[C@@]5(C)C(=O)CC[C@]1(OC)[C@@]5(CCN2C)c34