Reaction Details
TargetKappa-type opioid receptor
LigandBDBM50250449
Substrate/Competitorn/a
Meas. Tech.ChEBML_1681724
Ki 4.0±n/a nM
Citation Dumitrascuta, MBen Haddou, TGuerrieri, ENoha, SMSchläfer, LSchmidhammer, HSpetea, M Synthesis, Pharmacology, and Molecular Docking Studies on 6-Desoxo-N-methylmorphinans as Potent?-Opioid Receptor Agonists. J Med Chem60:9407-9412 (2017) 
 
Kappa-type opioid receptor
Name:Kappa-type opioid receptor
Type:G Protein-Coupled Receptor (GPCR)
Mol. Mass.:42648.76
Organism:Homo sapiens (Human)
Description:P41145
Residue:380
BDBM50250449
NameBDBM50250449
Synonyms:CHEMBL4065490
TypeSmall organic molecule
Emp. Form.C18H23NO3
Mol. Mass.301.3801
SMILES[H][C@@]12CCC[C@@]3(OC)[C@@]4([H])Cc5ccc(O)c(O1)c5[C@@]23CCN4C