Reaction Details
TargetKappa-type opioid receptor
LigandBDBM50250451
Substrate/Competitorn/a
Meas. Tech.ChEBML_1681724
Ki 7.9±n/a nM
Citation Dumitrascuta, MBen Haddou, TGuerrieri, ENoha, SMSchläfer, LSchmidhammer, HSpetea, M Synthesis, Pharmacology, and Molecular Docking Studies on 6-Desoxo-N-methylmorphinans as Potent?-Opioid Receptor Agonists. J Med Chem60:9407-9412 (2017) 
 
Kappa-type opioid receptor
Name:Kappa-type opioid receptor
Type:G Protein-Coupled Receptor (GPCR)
Mol. Mass.:42648.76
Organism:Homo sapiens (Human)
Description:P41145
Residue:380
BDBM50250451
NameBDBM50250451
Synonyms:CHEMBL4088589
TypeSmall organic molecule
Emp. Form.C19H25NO3
Mol. Mass.315.4067
SMILES[H][C@@]12Cc3ccc(O)c4O[C@@]5(C)CCC[C@]1(OC)[C@@]5(CCN2C)c34