Reaction Details
TargetKappa-type opioid receptor
LigandBDBM50250450
Substrate/Competitorn/a
Meas. Tech.ChEBML_1681724
Ki 0.850000±n/a nM
Citation Dumitrascuta, MBen Haddou, TGuerrieri, ENoha, SMSchläfer, LSchmidhammer, HSpetea, M Synthesis, Pharmacology, and Molecular Docking Studies on 6-Desoxo-N-methylmorphinans as Potent?-Opioid Receptor Agonists. J Med Chem60:9407-9412 (2017) 
 
Kappa-type opioid receptor
Name:Kappa-type opioid receptor
Type:G Protein-Coupled Receptor (GPCR)
Mol. Mass.:42648.76
Organism:Homo sapiens (Human)
Description:P41145
Residue:380
BDBM50250450
NameBDBM50250450
Synonyms:CHEMBL4103328
TypeSmall organic molecule
Emp. Form.C24H27NO3
Mol. Mass.377.4761
SMILES[H][C@@]12CCC[C@@]3(OCc4ccccc4)[C@@]4([H])Cc5ccc(O)c(O1)c5[C@@]23CCN4C