Reaction Details
TargetCoagulation factor XI
LigandBDBM50250480
Substrate/Competitorn/a
Meas. Tech.ChEBML_1681750
Ki 27±n/a nM
Citation Pinto, DJPOrwat, MJSmith, LMQuan, MLLam, PYSRossi, KAApedo, ABozarth, JMWu, YZheng, JJXin, BToussaint, NStetsko, PGudmundsson, OMaxwell, BCrain, EJWong, PCLou, ZHarper, TWChacko, SAMyers, JESheriff, SZhang, HHou, XMathur, ASeiffert, DAWexler, RRLuettgen, JMEwing, WR Discovery of a Parenteral Small Molecule Coagulation Factor XIa Inhibitor Clinical Candidate (BMS-962212). J Med Chem60:9703-9723 (2017) 
 
Coagulation factor XI
Name:Coagulation factor XI
Type:Enzyme
Mol. Mass.:70130.58
Organism:Homo sapiens (Human)
Description:P03951
Residue:625
BDBM50250480
NameBDBM50250480
Synonyms:CHEMBL4096900
TypeSmall organic molecule
Emp. Form.C32H30ClN7O6
Mol. Mass.644.077
SMILESCOCCN(C)C(=O)c1cccc2C(N(CCc12)C(=O)\C=C\c1cc(Cl)ccc1-n1cnnn1)C(=O)Nc1ccc(cc1)C(O)=O