Reaction Details
TargetCoagulation factor XI
LigandBDBM50250488
Substrate/Competitorn/a
Meas. Tech.ChEBML_1681750
Ki 25±n/a nM
Citation Pinto, DJPOrwat, MJSmith, LMQuan, MLLam, PYSRossi, KAApedo, ABozarth, JMWu, YZheng, JJXin, BToussaint, NStetsko, PGudmundsson, OMaxwell, BCrain, EJWong, PCLou, ZHarper, TWChacko, SAMyers, JESheriff, SZhang, HHou, XMathur, ASeiffert, DAWexler, RRLuettgen, JMEwing, WR Discovery of a Parenteral Small Molecule Coagulation Factor XIa Inhibitor Clinical Candidate (BMS-962212). J Med Chem60:9703-9723 (2017) 
 
Coagulation factor XI
Name:Coagulation factor XI
Type:Enzyme
Mol. Mass.:70130.58
Organism:Homo sapiens (Human)
Description:P03951
Residue:625
BDBM50250488
NameBDBM50250488
Synonyms:CHEMBL4100970
TypeSmall organic molecule
Emp. Form.C33H31ClN8O7
Mol. Mass.687.102
SMILESCCOC(=O)CCNC(=O)Nc1cccc2C(N(CCc12)C(=O)\C=C\c1cc(Cl)ccc1-n1cnnn1)C(=O)Nc1ccc(cc1)C(O)=O