Reaction Details
TargetCoagulation factor XI
LigandBDBM161055
Substrate/Competitorn/a
Meas. Tech.ChEBML_1681750
Ki 3.7±n/a nM
Citation Pinto, DJPOrwat, MJSmith, LMQuan, MLLam, PYSRossi, KAApedo, ABozarth, JMWu, YZheng, JJXin, BToussaint, NStetsko, PGudmundsson, OMaxwell, BCrain, EJWong, PCLou, ZHarper, TWChacko, SAMyers, JESheriff, SZhang, HHou, XMathur, ASeiffert, DAWexler, RRLuettgen, JMEwing, WR Discovery of a Parenteral Small Molecule Coagulation Factor XIa Inhibitor Clinical Candidate (BMS-962212). J Med Chem60:9703-9723 (2017) 
 
Coagulation factor XI
Name:Coagulation factor XI
Type:Enzyme
Mol. Mass.:70130.58
Organism:Homo sapiens (Human)
Description:P03951
Residue:625
BDBM161055
NameBDBM161055
Synonyms:US9108951, 10 US9725435, 10
TypeSmall organic molecule
Emp. Form.C27H20ClFN6O4
Mol. Mass.546.937
SMILESOC(=O)c1ccc(NC(=O)[C@H]2N(CCc3ccccc23)C(=O)\C=C\c2c(F)c(Cl)ccc2-n2cnnn2)cc1