Reaction Details
TargetMelanocyte-stimulating hormone receptor
LigandBDBM50268806
Substrate/Competitorn/a
Meas. Tech.ChEMBL_1681898 (CHEMBL4032175)
IC50 0.500000±n/a nM
Citation Zhou, YMowlazadeh Haghighi, SZoi, ISawyer, JRHruby, VJCai, M Design of MC1R Selective?-MSH Analogues with Canonical Amino Acids Leads to Potency and Pigmentation. J Med Chem60:9320-9329 (2017) 
 
Melanocyte-stimulating hormone receptor
Name:Melanocyte-stimulating hormone receptor
Type:Enzyme
Mol. Mass.:34717.23
Organism:Homo sapiens (Human)
Description:Q01726
Residue:317
BDBM50268806
NameBDBM50268806
Synonyms:Ac-Tyr-Val-Nle-Gly-His-DPhe-Arg-Trp-Asp-Arg-Phe-Gly-NH2) | CHEMBL503229
TypeSmall organic molecule
Emp. Form.C77H104N22O16
Mol. Mass.1593.7875
SMILESCCCC[C@H](NC(=O)[C@@H](NC(=O)[C@H](Cc1ccc(O)cc1)NC(C)=O)C(C)C)C(=O)NCC(=O)N[C@@H](Cc1cnc[nH]1)C(=O)N[C@H](Cc1ccccc1)C(=O)N[C@@H](CCCN=C(N)N)C(=O)N[C@@H](Cc1c[nH]c2ccccc12)C(=O)N[C@@H](CC(O)=O)C(=O)N[C@@H](CCCN=C(N)N)C(=O)N[C@@H](Cc1ccccc1)C(=O)NCC(N)=O