Reaction Details
TargetMelanocortin receptor 4
LigandBDBM50134946
Substrate/Competitorn/a
Meas. Tech.ChEBML_1681906
EC50 630±n/a nM
Citation Zhou, YMowlazadeh Haghighi, SZoi, ISawyer, JRHruby, VJCai, M Design of MC1R Selective?-MSH Analogues with Canonical Amino Acids Leads to Potency and Pigmentation. J Med Chem60:9320-9329 (2017) 
 
Melanocortin receptor 4
Name:Melanocortin receptor 4
Type:Enzyme
Mol. Mass.:36949.50
Organism:Homo sapiens (Human)
Description:P32245
Residue:332
BDBM50134946
NameBDBM50134946
Synonyms:CHEMBL2370964 | H-Tyr-Val-Nle-Gly-His-D-Nal(2')-Arg-Trp-Asp-Arg-Phe-Gly-NH2
TypeSmall organic molecule
Emp. Form.C79H104N22O15
Mol. Mass.1601.8095
SMILESCCCC[C@H](NC(=O)[C@@H](NC(=O)[C@@H](N)Cc1ccc(O)cc1)C(C)C)C(=O)NCC(=O)N[C@@H](Cc1c[nH]cn1)C(=O)N[C@H](Cc1ccc2ccccc2c1)C(=O)N[C@@H](CCCN=C(N)N)C(=O)N[C@@H](Cc1c[nH]c2ccccc12)C(=O)N[C@@H](CC(O)=O)C(=O)N[C@@H](CCCN=C(N)N)C(=O)N[C@@H](Cc1ccccc1)C(=O)NCC(N)=O