Reaction Details
TargetMelanocortin receptor 5
LigandBDBM50250582
Substrate/Competitorn/a
Meas. Tech.ChEBML_1681912
IC50 36±n/a nM
Citation Zhou, YMowlazadeh Haghighi, SZoi, ISawyer, JRHruby, VJCai, M Design of MC1R Selective?-MSH Analogues with Canonical Amino Acids Leads to Potency and Pigmentation. J Med Chem60:9320-9329 (2017) 
 
Melanocortin receptor 5
Name:Melanocortin receptor 5
Type:Enzyme
Mol. Mass.:36612.92
Organism:Homo sapiens (Human)
Description:P33032
Residue:325
BDBM50250582
NameBDBM50250582
Synonyms:CHEMBL4068654
TypeSmall organic molecule
Emp. Form.C73H100N20O15S
Mol. Mass.1529.765
SMILESCSCC[C@H](NC(=O)[C@@H](NC(=O)[C@@H](N)Cc1ccc(O)cc1)C(C)C)C(=O)NCC(=O)N1CCC[C@H]1C(=O)N[C@@H](Cc1ccccc1)C(=O)N[C@@H](CCCNC(N)=N)C(=O)N[C@@H](Cc1c[nH]c2ccccc12)C(=O)N[C@@H](CC(O)=O)C(=O)N[C@@H](CCCNC(N)=N)C(=O)N[C@@H](Cc1ccccc1)C(=O)NCC(N)=O