Reaction Details
TargetMuscarinic acetylcholine receptor M1
LigandBDBM50005856
Substrate/Competitorn/a
Meas. Tech.ChEMBL_138958 (CHEMBL742770)
Ki 15900±n/a nM
Citation Garvey, DSWasicak, JTChung, JYShue, YKCarrera, GMMay, PDMcKinney, MMAnderson, DCadman, EVella-Rountree, L Synthesis and in vitro characterization of novel amino terminally modified oxotremorine derivatives for brain muscarinic receptors. J Med Chem35:1550-7 (1992) Muscarinic acetylcholine receptor M1
Name:Muscarinic acetylcholine receptor M1
Type:Enzyme Catalytic Domain
Mol. Mass.:51390.46
Organism:RAT
Description:P08482
Residue:460
BDBM50005856
NameBDBM50005856
Synonyms:1-(4-Dimethylamino-but-2-ynyl)-pyrrolidin-2-one | CHEMBL41779
TypeSmall organic molecule
Emp. Form.C10H16N2O
Mol. Mass.180.2468
SMILESCN(C)CC#CCN1CCCC1=O