Reaction Details
Target5-hydroxytryptamine receptor 2C
LigandBDBM50250592
Substrate/Competitorn/a
Meas. Tech.ChEBML_1681948
EC50 16±n/a nM
Citation García-Cárceles, JDecara, JMVázquez-Villa, HRodríguez, RCodesido, ECruces, JBrea, JLoza, MIAlén, FBotta, JMcCormick, PJBallesteros, JABenhamú, BRodríguez de Fonseca, FLópez-Rodríguez, ML A Positive Allosteric Modulator of the Serotonin 5-HT J Med Chem60:9575-9584 (2017) 
 
5-hydroxytryptamine receptor 2C
Name:5-hydroxytryptamine receptor 2C
Type:G Protein-Coupled Receptor (GPCR)
Mol. Mass.:51836.79
Organism:Homo sapiens (Human)
Description:P28335
Residue:458
BDBM50250592
NameBDBM50250592
Synonyms:CHEMBL4095079
TypeSmall organic molecule
Emp. Form.C21H19N3
Mol. Mass.313.3957
SMILESC(Nc1cccnc1)c1cn(Cc2ccccc2)c2ccccc12