Reaction Details
TargetTyrosine-protein phosphatase non-receptor type 5
LigandBDBM50250598
Substrate/Competitorn/a
Meas. Tech.ChEBML_1681976
Ki 15000±n/a nM
Citation Witten, MRWissler, LSnow, MGeschwindner, SRead, JABrandon, NJNairn, ACLombroso, PJKäck, HEllman, JA X-ray Characterization and Structure-Based Optimization of Striatal-Enriched Protein Tyrosine Phosphatase Inhibitors. J Med Chem60:9299-9319 (2017) 
 
Tyrosine-protein phosphatase non-receptor type 5
Name:Tyrosine-protein phosphatase non-receptor type 5
Type:Enzyme Catalytic Domain
Mol. Mass.:63510.68
Organism:Homo sapiens (Human)
Description:gi_90652859
Residue:565
BDBM50250598
NameBDBM50250598
Synonyms:CHEMBL4066498
TypeSmall organic molecule
Emp. Form.C20H15Cl3FO4P
Mol. Mass.475.662
SMILESO[C@@H](c1ccc(cc1)-c1cccc(Cc2cc(Cl)c(Cl)cc2Cl)c1F)P(O)(O)=O