Reaction Details
TargetTyrosine-protein phosphatase non-receptor type 5
LigandBDBM50250601
Substrate/Competitorn/a
Meas. Tech.ChEBML_1681976
Ki 1000±n/a nM
Citation Witten, MRWissler, LSnow, MGeschwindner, SRead, JABrandon, NJNairn, ACLombroso, PJKäck, HEllman, JA X-ray Characterization and Structure-Based Optimization of Striatal-Enriched Protein Tyrosine Phosphatase Inhibitors. J Med Chem60:9299-9319 (2017) 
 
Tyrosine-protein phosphatase non-receptor type 5
Name:Tyrosine-protein phosphatase non-receptor type 5
Type:Enzyme Catalytic Domain
Mol. Mass.:63510.68
Organism:Homo sapiens (Human)
Description:gi_90652859
Residue:565
BDBM50250601
NameBDBM50250601
Synonyms:CHEMBL4070970
TypeSmall organic molecule
Emp. Form.C27H24Cl3F2O4P
Mol. Mass.587.807
SMILESOP(O)(=O)C(F)(C(=O)C1CCCCC1)c1ccc(cc1)-c1cccc(Cc2cc(Cl)c(Cl)cc2Cl)c1F