Reaction Details
TargetTyrosine-protein phosphatase non-receptor type 5
LigandBDBM50441303
Substrate/Competitorn/a
Meas. Tech.ChEBML_1681976
Ki 16000±n/a nM
Citation Witten, MRWissler, LSnow, MGeschwindner, SRead, JABrandon, NJNairn, ACLombroso, PJKäck, HEllman, JA X-ray Characterization and Structure-Based Optimization of Striatal-Enriched Protein Tyrosine Phosphatase Inhibitors. J Med Chem60:9299-9319 (2017) 
 
Tyrosine-protein phosphatase non-receptor type 5
Name:Tyrosine-protein phosphatase non-receptor type 5
Type:Enzyme Catalytic Domain
Mol. Mass.:63510.68
Organism:Homo sapiens (Human)
Description:gi_90652859
Residue:565
BDBM50441303
NameBDBM50441303
Synonyms:CHEMBL2431687
TypeSmall organic molecule
Emp. Form.C20H15Cl2F2O4P
Mol. Mass.459.207
SMILESOC(c1cccc(c1)-c1ccc(cc1)C(F)(F)P(O)(O)=O)c1ccc(Cl)c(Cl)c1