Reaction Details
TargetFatty-acid amide hydrolase 1
LigandBDBM50250854
Substrate/Competitorn/a
Meas. Tech.ChEBML_1682355
IC50 1.1±n/a nM
Citation Butler, CRBeck, EMHarris, AHuang, ZMcAllister, LAAm Ende, CWFennell, KFoley, TLFonseca, KHawrylik, SJJohnson, DSKnafels, JDMente, SNoell, GSPandit, JPhillips, TBPiro, JRRogers, BNSamad, TAWang, JWan, SBrodney, MA Azetidine and Piperidine Carbamates as Efficient, Covalent Inhibitors of Monoacylglycerol Lipase. J Med Chem60:9860-9873 (2017) 
 
Fatty-acid amide hydrolase 1
Name:Fatty-acid amide hydrolase 1
Type:Protein
Mol. Mass.:63071.19
Organism:Homo sapiens (Human)
Description:O00519
Residue:579
BDBM50250854
NameBDBM50250854
Synonyms:CHEMBL4079190
TypeSmall organic molecule
Emp. Form.C14H11F6N5O2
Mol. Mass.395.2599
SMILESFC(F)(F)C(OC(=O)N1CC(C1)c1ccn(n1)-c1cnccn1)C(F)(F)F