Reaction Details
TargetMonoglyceride lipase
LigandBDBM50250849
Substrate/Competitorn/a
Meas. Tech.ChEBML_1682364
IC50 1.9±n/a nM
Citation Butler, CRBeck, EMHarris, AHuang, ZMcAllister, LAAm Ende, CWFennell, KFoley, TLFonseca, KHawrylik, SJJohnson, DSKnafels, JDMente, SNoell, GSPandit, JPhillips, TBPiro, JRRogers, BNSamad, TAWang, JWan, SBrodney, MA Azetidine and Piperidine Carbamates as Efficient, Covalent Inhibitors of Monoacylglycerol Lipase. J Med Chem60:9860-9873 (2017) 
 
Monoglyceride lipase
Name:Monoglyceride lipase
Type:Hydrolase
Mol. Mass.:33264.56
Organism:Homo sapiens (Human)
Description:Human recombinant MGL (Cayman Chemical, cat# 10008354).
Residue:303
BDBM50250849
NameBDBM50250849
Synonyms:CHEMBL4068332
TypeSmall organic molecule
Emp. Form.C15H16F6N4O3
Mol. Mass.414.303
SMILESFC(F)(F)C(OC(=O)N1CC(C1)c1ccnc(n1)N1CCOCC1)C(F)(F)F